{"text_format":"1","workbook":"xlsx","n_sheets":17,"sheets":["Cover","Version control","Guidance Notes","Calculator","Printable Estimate","Parameters","Tapers","Commutation Factors","LRF","ERF","FS calcs","Lump Sum","nuvos Calcs","alpha calcs","nuvos CARE calcs_NOT USED","alpha CARE calcs_NOT USED","Summary"],"not_rendered":{"charts":0,"images":1,"macros":1,"external_links":0,"defined_names":143,"comments":6,"pivot_tables":0},"unopened":[],"bounds":{"document_bytes":16777216,"sheet_cells":100000,"rows_first":2000,"rows_last":500,"rows_between":2000,"halvings":0,"cell_chars":16384,"cell_head_chars":4096},"cells_cut":0,"cells_raw":0,"read":"whole","date_system":"1900"}

{"sheet":"Cover","index":0,"n_rows":67,"n_cols":2,"rows_kept":67,"cut":false,"hidden":true,"merged":[]}
["Government Actuary's Department"]
["Northern Ireland Civil Service Pension Scheme Calculator"]
["Cover"]
[{"$f":"CELL(\"filename\",A1)","v":"C:\\Users\\dof-aytond\\Desktop\\[NICS - BenProjectCalculator v0.21.xlsm]Cover"}]
[]
["Security classification "]
["Descriptor"]
[]
["Specification"]
[]
{"$rows_left_out":58}
{"sheet":"Version control","index":1,"n_rows":138,"n_cols":12,"rows_kept":138,"cut":false,"hidden":true,"merged":[]}
["Government Actuary's Department"]
[{"$f":"IF(title=\"> Enter workbook title here\",\"Enter workbook title in Cover sheet\",title)","v":"Northern Ireland Civil Service Pension Scheme Calculator"}]
["Version Control"]
[{"$f":"CELL(\"filename\",A1)","v":"C:\\Users\\dof-aytond\\Desktop\\[NICS - BenProjectCalculator v0.21.xlsm]Version control"}]
[]
["Version number","File pathname","Paper file","eBis code","Internal or external documents based on this version","Author or Editor","Date","Comments","Checked by","Date","Comments","External links checked?"]
["1_1","K:\\a2clients\\Police Pensions\\0140-00972 Home Office Police\\Cost Ceiling\\Pension estimator\\[Pension calculator v0.01.xlsm]Version control",null,null,null,"Michael Crabtree","2012-08-15","Produced inputs / outputs sheet that will be visible to clients and set up calcs for tapering","Brian Allan","2012-08-16","Comments on input output and first stage of PPS/NPPS calcs in my email of 16 Aug 2012 15:30"]
[2,"K:\\a2clients\\Police Pensions\\0140-00972 Home Office Police\\Cost Ceiling\\Pension estimator\\[Pension calculator v0.02.xlsm]Version control",null,null,null,"Michael Crabtree","2012-08-17","Created subsections for calculating service period and benefits in current and new schemes, noting need to separate them for those retiring before and after protection date, and made a start on producing summary sheet","Brian Allan","2012-08-20","Comments on whole calculator:\npension at retirement continuing in current scheme missing\nCARE ERFs incorrect and formula I supplied for CARE does not work for deferred benefits at SPA.\nSome tidying of the sheet","Yes: Link in Parameters sheet correct"]
[3,"K:\\a2clients\\Police Pensions\\0140-00972 Home Office Police\\Cost Ceiling\\Pension estimator\\[Pension calculator v0.03.xlsm]Version control",null,null,null,"Michael Crabtree","2012-08-21","Produced further calcs to look at results if there was no reform and added deferred benefit calcs available at SPA for PPS members who retire before age 55","Brian Allan","2012-08-21","Pension at retirement ignoring reform missing from output sheet\nCARE  formula I supplied for CARE needs a correction which then allows simplification\nMore results needed on Summary sheet."]
[4,"K:\\a2clients\\Police Pensions\\0140-00972 Home Office Police\\Cost Ceiling\\Pension estimator\\[Pension calculator v0.04.xlsm]Version control",null,null,null,"Michael Crabtree","2012-08-21","Added results looking at benefits under no reform in outputs, made a correction to new scheme pension formula and put more information in the summary sheet","Brian Allan","2012-08-21","Summary sheet has:\nincorrect reference for expected retirement date of retirement and age at retirement\nneeds service to retirement for NO REFORM\n\nAmended some labelling in PPS and NPPS Calcs"]
{"$rows_left_out":129}
{"sheet":"Guidance Notes","index":2,"n_rows":43,"n_cols":4,"rows_kept":43,"cut":false,"hidden":false,"merged":[[42,1,42,10],[36,1,36,10],[37,1,37,10],[38,1,38,10],[39,1,39,10],[40,1,40,9],[41,1,41,10],[35,1,35,10],[24,1,24,10],[25,1,25,10],[26,1,26,10],[27,1,27,10],[29,1,29,10],[30,1,30,10],[31,1,31,10],[32,1,32,10],[33,1,33,10],[34,1,34,10],[23,1,23,10],[13,1,13,10],[14,1,14,10],[15,1,15,10],[16,1,16,10],[17,1,17,10],[18,1,18,10],[19,1,19,10],[20,1,20,10],[21,1,21,10],[22,1,22,10],[12,1,12,10],[0,1,3,10],[7,1,7,10],[8,1,8,10],[10,1,10,10],[11,1,11,10],[9,1,9,10],[5,1,5,10]]}
[]
[]
[]
[]
[null,"Date calculator last updated:",null,"2026-08-01"]
[null,{"$f":"\"Scheme factors are required to determine benefits payable and these factors are reviewed periodically. The calculator uses factors in force as at \" & TEXT(D5,\"dd mmmm yyyy\") & \". When you actually retire, the scheme factors in force at the time will be used, if appropriate. This may produce different results, other things being equal, to those illustrated here.\"","v":"Scheme factors are required to determine benefits payable and these factors are reviewed periodically. The calculator uses factors in force as at 01 August 2026. When you actually retire, the scheme factors in force at the time will be used, if appropriate. This may produce different results, other things being equal, to those illustrated here."}]
[null,"Understanding the results (Notes and Assumptions)"]
[null,"- This calculator is solely for guidance purposes and is an estimate only. It is not intended to provide you with financial advice. If you require financial advice, you should contact an Independent Financial Advisor (IFA). You can find tips on finding an IFA by visiting the Financial Conduct Authority website: "]
[null,"www.fca.org.uk "]
[null,"- This calculator is designed for members who are not affected by the McCloud remedy. Members who are affected by the McCloud remedy should use the alternative illustrator provided on the CSP(NI) website."]
{"$rows_left_out":34}
{"sheet":"Calculator","index":3,"n_rows":175,"n_cols":18,"rows_kept":175,"cut":false,"hidden":false,"merged":[[90,6,91,8],[66,7,66,11],[68,7,68,11],[8,1,8,12],[95,1,95,12],[9,1,9,12],[10,1,10,12],[17,8,17,9],[52,1,53,6],[122,1,122,12],[117,1,117,12],[121,1,121,12],[110,1,110,12],[94,1,94,12],[97,1,97,12],[109,1,109,12],[104,1,104,12],[101,1,101,12],[96,1,96,12],[99,1,99,12],[100,1,100,12],[102,1,102,12],[98,1,98,12],[66,13,66,17],[68,13,68,17],[6,1,6,12],[7,1,7,12],[124,1,124,12],[107,1,107,12],[112,1,112,12],[113,1,113,12],[118,1,118,12],[114,1,114,12],[123,1,123,12],[115,1,115,12],[108,1,108,12],[105,1,105,12],[106,1,106,12],[103,1,103,12]]}
[]
[]
[]
[]
[]
[null,"Northern Ireland Civil Service Pension Scheme Benefits Projector"]
[null,"Important information - please read this before you start"]
[null,"- This calculator will provide an illustration of your pension and lump sum at a chosen retirement age."]
[null,"- The results shown are only estimates, based on what you input and other assumptions."]
[null,"- Please read the Guidance Notes for further details and limitations on the results produced."]
{"$rows_left_out":166}
{"sheet":"Printable Estimate","index":4,"n_rows":46,"n_cols":6,"rows_kept":46,"cut":false,"hidden":false,"merged":[[5,1,7,6],[35,2,35,4],[14,4,14,5],[24,4,24,5],[27,1,27,6]]}
[]
[]
[]
[null,"Northern Ireland Civil Service Pension Scheme"]
[]
[null,"This calculator is for guidance purposes only. It is an estimate only and is not a guarantee of future benefits. It is not intended to provide you with financial advice. If you require financial advice, you should contact an independent financial adviser. "]
[]
[]
[]
[null,"This projection should be read along with the accompanying notes. "]
{"$rows_left_out":37}
{"sheet":"Parameters","index":5,"n_rows":123,"n_cols":14,"rows_kept":123,"cut":false,"hidden":true,"merged":[[31,3,31,4]]}
["Government Actuary's Department"]
[{"$f":"IF(title=\"> Enter workbook title here\",\"Enter workbook title in Cover sheet\",title)","v":"Northern Ireland Civil Service Pension Scheme Calculator"}]
["Parameters"]
[{"$f":"CELL(\"filename\",A1)","v":"C:\\Users\\dof-aytond\\Desktop\\[NICS - BenProjectCalculator v0.21.xlsm]Parameters"}]
[]
[null,null,null,null,null,"NRA"]
[null,"Current schemes",null,null,"classic",60]
[null,null,null,null,"classic plus",60]
[null,null,null,null,"premium",60]
[null,null,null,null,"nuvos",65]
{"$rows_left_out":114}
{"sheet":"Tapers","index":6,"n_rows":54,"n_cols":21,"rows_kept":54,"cut":false,"hidden":true,"merged":[[10,18,10,19],[10,2,10,3],[10,13,10,14],[10,4,10,5],[10,7,10,8],[10,15,10,16]]}
["Government Actuary's Department"]
[{"$f":"IF(title=\"> Enter workbook title here\",\"Enter workbook title in Cover sheet\",title)","v":"Northern Ireland Civil Service Pension Scheme Calculator"}]
["Tapers"]
[{"$f":"CELL(\"filename\",A1)","v":"C:\\Users\\dof-aytond\\Desktop\\[NICS - BenProjectCalculator v0.21.xlsm]Tapers"}]
[]
[null,null,"Source:","https://www.civilservicepensionscheme.org.uk/members/the-new-pension-scheme-alpha/how-will-this-affect-me/active-members/dates-that-you-will-move-to-the-new-scheme/"]
[]
[]
[]
[null,null,"Classic, classic plus and premium",null,null,null,null,null,null,null,null,null,null,"nuvos members"]
{"$rows_left_out":45}
{"sheet":"Commutation Factors","index":7,"n_rows":29,"n_cols":9,"rows_kept":29,"cut":false,"hidden":true,"merged":[]}
["Government Actuary's Department"]
[{"$f":"IF(title=\"> Enter workbook title here\",\"Enter workbook title in Cover sheet\",title)","v":"Northern Ireland Civil Service Pension Scheme Calculator"}]
["Commutation"]
[{"$f":"CELL(\"filename\",A1)","v":"C:\\Users\\dof-aytond\\Desktop\\[NICS - BenProjectCalculator v0.21.xlsm]Commutation Factors"}]
[]
[]
[null,"Classic Scheme Commutation Factor",null,null,null,12]
[null,"Classic Plus Scheme Commutation Factor",null,null,null,12]
[null,"Premium Scheme Commutation Factor",null,null,null,12]
[null,"nuvos Scheme Commutation Factor",null,null,null,12]
{"$rows_left_out":20}
{"sheet":"LRF","index":8,"n_rows":77,"n_cols":18,"rows_kept":77,"cut":false,"hidden":true,"merged":[]}
["Government Actuary's Department"]
[{"$f":"IF(title=\"> Enter workbook title here\",\"Enter workbook title in Cover sheet\",title)","v":"Northern Ireland Civil Service Pension Scheme Calculator"}]
["LRF"]
[{"$f":"CELL(\"filename\",A1)","v":"C:\\Users\\dof-aytond\\Desktop\\[NICS - BenProjectCalculator v0.21.xlsm]LRF"}]
[]
[null,"Source:"]
[null,"\\\\Gad-ast\\ast\\PSPS\\NICSPS\\_tools\\Received from PSPS\\CS NI Consolidated Factors 2023-04.xlsm"]
[]
[]
[null,"TABLE LRF01",null,null,null,"Not updated as no longer used - Nuvos calculations use Alpha factor table as Nuvos ERFs/LRFs are now aligned with Alpha"]
{"$rows_left_out":68}
{"sheet":"ERF","index":9,"n_rows":340,"n_cols":20,"rows_kept":340,"cut":false,"hidden":true,"merged":[[323,19,323,25],[324,19,324,25],[325,19,325,25],[326,19,326,25]]}
["Government Actuary's Department"]
[{"$f":"IF(title=\"> Enter workbook title here\",\"Enter workbook title in Cover sheet\",title)","v":"Northern Ireland Civil Service Pension Scheme Calculator"}]
["ERF"]
[{"$f":"CELL(\"filename\",A1)","v":"C:\\Users\\dof-aytond\\Desktop\\[NICS - BenProjectCalculator v0.21.xlsm]ERF"}]
[]
[null,"Source:"]
[null,"\\\\Gad-ast\\ast\\PSPS\\NICSPS\\_tools\\Received from PSPS\\CS NI Consolidated Factors 2023-04.xlsm"]
[]
[]
[null,"TABLE ERF01"]
{"$rows_left_out":331}
{"sheet":"FS calcs","index":10,"n_rows":77,"n_cols":10,"rows_kept":77,"cut":false,"hidden":true,"merged":[[68,1,73,1],[12,1,24,1],[25,1,29,1],[30,1,36,1],[55,1,57,1],[62,1,67,1],[58,1,61,1],[37,1,42,1],[49,1,54,1],[43,1,48,1]]}
["Government Actuary's Department"]
[{"$f":"IF(title=\"> Enter workbook title here\",\"Enter workbook title in Cover sheet\",title)","v":"Northern Ireland Civil Service Pension Scheme Calculator"}]
["Classic, premium, classic plus"]
[{"$f":"CELL(\"filename\",A1)","v":"C:\\Users\\dof-aytond\\Desktop\\[NICS - BenProjectCalculator v0.21.xlsm]FS calcs"}]
[]
[null,null,"Exact Age (at start of scheme year)",{"$f":"(StartScheme_Current-DoB)/DoY","v":126.25051334702259}]
[null,null,"Age at protection date",{"$f":"(ProtectDate-DoB)/DoY","v":112.25188227241615}]
[null,null,"Age at entry exact",{"$f":"(DJS-DoB)/DoY","v":0}]
[null,null,"Lower of retirement, protection date",{"$f":"MIN(D12,D25)","v":"00:00:00"}]
[null,null,null,null,null,null,null,"Datedif uses the first year when determining leap years (!)",null,"http://www.cpearson.com/excel/datedif.aspx"]
{"$rows_left_out":68}
{"sheet":"Lump Sum","index":11,"n_rows":57,"n_cols":6,"rows_kept":57,"cut":false,"hidden":true,"merged":[]}
["Government Actuary's Department"]
[{"$f":"IF(title=\"> Enter workbook title here\",\"Enter workbook title in Cover sheet\",title)","v":"Northern Ireland Civil Service Pension Scheme Calculator"}]
["Lump Sum Commutation"]
[{"$f":"CELL(\"filename\",A1)","v":"C:\\Users\\dof-aytond\\Desktop\\[NICS - BenProjectCalculator v0.21.xlsm]Lump Sum"}]
[]
[]
[]
[]
[null,null,null,"Pre 2015","Post 2015 at SPA"]
[null,null,"Commutation Factor",{"$f":"+VLOOKUP(Scheme_Full,Lump_sum_factors,2,0)","v":{"$error":"#N/A"}},{"$f":"+VLOOKUP(\"alpha\",Lump_sum_factors,2,0)","v":12}]
{"$rows_left_out":48}
{"sheet":"nuvos Calcs","index":12,"n_rows":59,"n_cols":87,"rows_kept":59,"cut":false,"hidden":true,"merged":[]}
["Government Actuary's Department"]
[{"$f":"IF(title=\"> Enter workbook title here\",\"Enter workbook title in Cover sheet\",title)","v":"Northern Ireland Civil Service Pension Scheme Calculator"}]
["Nuvos pension"]
[{"$f":"CELL(\"filename\",A1)","v":"C:\\Users\\dof-aytond\\Desktop\\[NICS - BenProjectCalculator v0.21.xlsm]nuvos Calcs"}]
[]
[]
[]
[null,"Current Date",null,{"$f":"DoStartSchYear_nuvos","v":"2026-04-01"}]
[null,"CPI (%)",null,{"$f":"cpi","v":0.02}]
[null,"Revaluation Rate - CPI + 0%",null,{"$f":"care_rev","v":0.02}]
{"$rows_left_out":50}
{"sheet":"alpha calcs","index":13,"n_rows":58,"n_cols":87,"rows_kept":58,"cut":false,"hidden":true,"merged":[]}
["Government Actuary's Department"]
[{"$f":"IF(title=\"> Enter workbook title here\",\"Enter workbook title in Cover sheet\",title)","v":"Northern Ireland Civil Service Pension Scheme Calculator"}]
["Alpha pension"]
[{"$f":"CELL(\"filename\",A1)","v":"C:\\Users\\dof-aytond\\Desktop\\[NICS - BenProjectCalculator v0.21.xlsm]alpha calcs"}]
[]
[]
[]
[null,"Current Date",null,{"$f":"DoStartSchYear_alpha","v":"2026-04-01"}]
[null,"CPI (%)",null,{"$f":"cpi","v":0.02}]
[null,"Revaluation Rate - CPI + 0%",null,{"$f":"care_rev","v":0.02}]
{"$rows_left_out":49}
{"sheet":"nuvos CARE calcs_NOT USED","index":14,"n_rows":42,"n_cols":6,"rows_kept":42,"cut":false,"hidden":true,"merged":[[4,3,6,6],[12,4,12,6]]}
["Government Actuary's Department"]
[{"$f":"IF(title=\"> Enter workbook title here\",\"Enter workbook title in Cover sheet\",title)","v":"Northern Ireland Civil Service Pension Scheme Calculator"}]
["CARE calcs"]
[{"$f":"CELL(\"filename\",A1)","v":"C:\\Users\\dof-aytond\\Desktop\\[NICS - BenProjectCalculator v0.21.xlsm]nuvos CARE calcs_NOT USED"}]
[null,null,null,"the general method is to project care from the start of the current scheme year, then subtract off what would be accrued during the remaining part of the taper in that period, revalued to the DoR."]
[]
[]
[]
[null,null,"Protection Status",{"$f":"'FS calcs'!ProtStatus","v":true}]
[null,null,"Date Protection Date ends",{"$f":"'nuvos Calcs'!D15","v":"00:00:00"}]
{"$rows_left_out":33}
{"sheet":"alpha CARE calcs_NOT USED","index":15,"n_rows":42,"n_cols":6,"rows_kept":42,"cut":false,"hidden":true,"merged":[[12,4,12,6],[4,3,6,6]]}
["Government Actuary's Department"]
[{"$f":"IF(title=\"> Enter workbook title here\",\"Enter workbook title in Cover sheet\",title)","v":"Northern Ireland Civil Service Pension Scheme Calculator"}]
["CARE calcs"]
[{"$f":"CELL(\"filename\",A1)","v":"C:\\Users\\dof-aytond\\Desktop\\[NICS - BenProjectCalculator v0.21.xlsm]alpha CARE calcs_NOT USED"}]
[null,null,null,"the general method is to project care from the start of the current scheme year, then subtract off what would be accrued during the remaining part of the taper in that period, revalued to the DoR."]
[]
[]
[]
[null,null,"Protection Status",{"$f":"'FS calcs'!ProtStatus","v":true}]
[null,null,"Date Protection Date ends",{"$f":"IF(Scheme_Full=\"nuvos\",'nuvos Calcs'!D15,'FS calcs'!DoProtEnd)","v":"00:00:00"}]
{"$rows_left_out":33}
{"sheet":"Summary","index":16,"n_rows":53,"n_cols":10,"rows_kept":53,"cut":false,"hidden":true,"merged":[[7,1,20,1],[31,1,36,1],[42,1,47,1],[48,1,52,1],[23,1,28,1]]}
["Government Actuary's Department"]
[{"$f":"IF(title=\"> Enter workbook title here\",\"Enter workbook title in Cover sheet\",title)","v":"Northern Ireland Civil Service Pension Scheme Calculator"}]
["Diagnostic summary sheet"]
[{"$f":"CELL(\"filename\",A1)","v":"C:\\Users\\dof-aytond\\Desktop\\[NICS - BenProjectCalculator v0.21.xlsm]Summary"}]
[null,null,null,"Real",null,null,null,"Nominal"]
[]
[null,null,null,{"$f":"basis1","v":"CPI + 0.0%"},{"$f":"basis2","v":"CPI + 1.0%"},{"$f":"basis3","v":"CPI + 2.0%"},null,{"$f":"basis1","v":"CPI + 0.0%"},{"$f":"basis2","v":"CPI + 1.0%"},{"$f":"basis3","v":"CPI + 2.0%"}]
[null,"Pre-2015 Calcs Used And Results (FS)","Current Salary",{"$f":"CurrentSal","v":0},{"$f":"D8","v":0},{"$f":"D8","v":0},null,{"$f":"CurrentSal","v":0},{"$f":"H8","v":0},{"$f":"H8","v":0}]
[null,null,"Projected Salary",{"$f":"'FS calcs'!G32","v":{"$error":"#NUM!"}},{"$f":"'FS calcs'!G33","v":{"$error":"#NUM!"}},{"$f":"'FS calcs'!G34","v":{"$error":"#NUM!"}},null,{"$f":"D9","v":{"$error":"#NUM!"}},{"$error":"#NUM!"},{"$error":"#NUM!"}]
[null,null,"Discounted Project Salary",{"$f":"'FS calcs'!G35","v":{"$error":"#NUM!"}},{"$f":"'FS calcs'!G36","v":{"$error":"#NUM!"}},{"$f":"'FS calcs'!G37","v":{"$error":"#NUM!"}},null,{"$error":"#NUM!"},{"$error":"#NUM!"},{"$error":"#NUM!"}]
{"$rows_left_out":43}